{"text_format":"1","workbook":"xlsx","n_sheets":11,"sheets":["Start","Overview","LifeCycle","Use","Infrastructure","Results","Comparision","Calculation","Data","About","History"],"not_rendered":{"charts":16,"images":14,"macros":1,"external_links":1,"defined_names":91,"comments":0,"pivot_tables":0},"unopened":[],"bounds":{"document_bytes":16777216,"sheet_cells":100000,"rows_first":2000,"rows_last":500,"rows_between":2000,"halvings":0,"cell_chars":16384,"cell_head_chars":4096},"cells_cut":0,"cells_raw":0,"read":"whole","date_system":"1900"}

{"sheet":"Start","index":0,"n_rows":13,"n_cols":2,"rows_kept":13,"cut":false,"hidden":false,"merged":[]}
[null,"Preface"]
[]
[null,"Excellent engineers use a systematic way of thinking. And in the field of energy and material efficient product design they are in need of a methodology to guide especially early planning and decision making steps in der product development process. One element of great importance is the so called \"life cycle thinking\" and a pragmatic and easy to handle evaluation of all energy and material impacts over all product life cycle. This tool offers such a planning frame work."]
[null,"Since more than 20 years, ecodesign experts in mechanical industry have been concerned with the question of how industrial products and especially machine tools can be improved in an ecological sense. As some products are often used in different ways by different customers, usage itself has to be hypothesized as a variable entity. Ecodesign therefore requires system knowhow. This is about more than just “filter & recycling“; much rather better products and production systems are required. Once you start looking at machines, respectively production systems, the complexity of the product increases enormously. \nFor ecodesign in the machine industry specific knowhow is essential - knowhow which is not yet or only partly available. "]
[null,"Ecodesign aims to achieve an improvement of products which particularly also fulfils eco-logical criteria. The challenge for product development is to see the product as a whole, to see it as a system, which is bonded in a relationship with the environment and which impacts the environment in different ways throughout all of its product life phases. The design process is crucial for this; the designer has to recognize when and where potentially significant impact on the environment could occur and how he / she can influence i.e. improve these. This process, therefore, entails a specific analysis of the “system and its environment“ as well as the search for solutions on the basis of identified or suspected specific ecological weaknesses. This is the only way to achieve real improvements. "]
[null,"This is where the following tool proves to be useful. The tool provides a framework; all information about an existing or planned product can be modelled. "]
[]
[null,"The calculation itself is based on energy consumption. The energy-profiles and some other calculations provide a first interpretation of significant and non-significant functions and components. This transparency is useful especially in the early stage of product development."]
[null,"The tool was mainly developed within a project which was endorsed by \"Swiss Electric Research\"; the main project partners have been ETH Zürich and Züst Engineering AG; five companies which are producing machine tools have been industrial partners - a big thank you to all project partners!"]
[]
{"$rows_left_out":4}
{"sheet":"Overview","index":1,"n_rows":43,"n_cols":10,"rows_kept":43,"cut":false,"hidden":false,"merged":[[1,7,1,10],[4,8,4,10],[13,8,13,10],[25,8,25,10],[37,8,37,10],[2,7,2,10],[25,1,25,3],[37,1,37,3],[4,1,4,3],[1,0,1,3],[13,1,13,3]]}
[null,null,null,{"$f":"Version","v":"ET-MTED-V3R1"}]
["Eco design of Machines:  Potential Estimation Tool",null,null,null,null,null,null,"Eco design of Machines:  Potential Estimation Tool"]
[null,null,null,null,null,null,null,"EXAMPLE"]
[]
["Overview","In this section, general information about the machine is collected. This information will later be used for a structured data input and the analysis of the machines energetic footprint",null,null,null,null,null,"Overview","In this section, general information about the machine is collected. This information will later be used for a structured data input and the analysis of the machines energetic footprint"]
[]
[]
["General","Name of the machine","Test",null,null,null,null,"General","Name of the machine","Test"]
[null,"Company","My Company",null,null,null,null,null,"Company","My Company"]
[null,"Price per unit",100000,null,null,null,null,null,"Price per unit",100000]
{"$rows_left_out":34}
{"sheet":"LifeCycle","index":2,"n_rows":178,"n_cols":20,"rows_kept":178,"cut":false,"hidden":false,"merged":[[1,0,1,7],[44,5,44,6],[50,3,50,6],[4,1,4,6],[47,3,47,6],[49,3,49,6],[52,3,52,6],[53,3,53,6],[54,3,54,6],[55,3,55,6],[56,3,56,6],[66,5,66,6],[46,0,66,0],[7,0,44,0],[68,0,88,0],[90,0,110,0],[88,5,88,6],[110,5,110,6],[63,3,63,6],[64,3,64,6],[65,3,65,6],[61,3,61,6],[62,3,62,6],[51,3,51,6],[60,3,60,6],[58,3,58,6],[59,3,59,6],[157,0,177,0],[128,2,128,6],[112,0,123,0],[123,5,123,6],[143,1,143,6],[125,0,155,0],[177,5,177,6],[119,2,119,6],[120,2,120,6],[121,2,121,6],[122,2,122,6],[155,5,155,6],[1,13,1,20],[4,14,4,19],[7,13,44,13],[44,18,44,19],[46,13,66,13],[47,16,47,19],[49,16,49,19],[50,16,50,19],[51,16,51,19],[52,16,52,19],[53,16,53,19],[54,16,54,19],[55,16,55,19],[56,16,56,19],[58,16,58,19],[59,16,59,19],[157,13,177,13],[177,18,177,19],[112,13,123,13],[119,15,119,19],[120,15,120,19],[121,15,121,19],[122,15,122,19],[123,18,123,19],[2,13,3,20],[125,13,155,13],[128,15,128,19],[143,14,143,19],[155,18,155,19],[65,16,65,19],[66,18,66,19],[68,13,88,13],[88,18,88,19],[90,13,110,13],[110,18,110,19],[60,16,60,19],[61,16,61,19],[62,16,62,19],[63,16,63,19],[64,16,64,19]]}
[null,null,null,null,null,null,null,{"$f":"Version","v":"ET-MTED-V3R1"}]
["Life-Cycle",null,null,null,null,null,null,null,null,null,null,null,null,"Life-Cycle"]
[null,null,null,null,null,null,null,null,null,null,null,null,null,"EXAMPLE"]
[]
["Overview","During the life cycle analysis, information about each life phase of the machine are collected. Based on this information the primary energy required for the machine life time is calculated. This life time includes the following steps:\n\n    1. Raw materials\n    2. Purchasing & Production\n    3. Packaging\n    4. Transportation\n    5. Operation\n    6. Recycling\n \n(The additional infrastructures as the utilization by the customer are quantified the  sheets \"Infrastructure\" and \"Use\".)\n",null,null,null,null,null,null,null,null,null,null,null,"Overview","During the life cycle analysis, information about each life phase of the machine are collected. Based on this information the primary energy required for the machine life time is calculated. This life time includes the following steps:\n\n    1. Raw materials\n    2. Purchasing & Production\n    3. Packaging\n    4. Transportation\n    5. Operation\n    6. Recycling\n \n(The additional infrastructures as the utilization by the customer are quantified the  sheets \"Infrastructure\" and \"Use\".)\n"]
[]
[]
["Raw materials",null,"Material 1","Material 2","Material 3","Material 4","Material 5",null,null,null,null,null,null,"Raw materials",null,"Material 1","Material 2","Material 3","Material 4","Material 5"]
[null,"Machine structure","steel, iron","cast iron","aluminium, copper, brass","electronics",null,null,null,null,null,null,null,null,"Machine structure","steel, iron","cast iron","aluminium, copper, brass","electronics"]
[null,{"$f":"SUM(C10:G10)","v":4201},2000,2000,200,1,null,null,null,null,null,null,null,null,{"$f":"SUM(P10:T10)","v":4201},2000,2000,200,1]
{"$rows_left_out":169}
{"sheet":"Use","index":3,"n_rows":73,"n_cols":19,"rows_kept":73,"cut":false,"hidden":false,"merged":[[40,0,40,3],[42,1,42,3],[54,1,54,3],[67,1,67,3],[1,0,1,3],[4,1,4,2],[15,1,15,2],[20,1,20,2],[26,1,26,2],[31,1,31,2],[61,1,61,3],[1,10,1,13],[4,11,4,12],[15,11,15,12],[20,11,20,12],[26,11,26,12],[2,10,3,13],[2,14,3,14],[45,14,52,14],[56,14,59,14],[69,14,72,14],[31,11,31,12],[40,10,40,13],[42,11,42,13],[54,11,54,13],[67,11,67,13],[61,11,61,13]]}
[null,null,null,{"$f":"Version","v":"ET-MTED-V3R1"}]
["Machine Schedule",null,null,null,null,null,null,null,null,null,"Machine Schedule"]
[null,null,null,null,null,null,null,null,null,null,"EXAMPLE",null,null,null,"COMMENTS"]
[]
["Process time","General description of an intended process running on the machine",null,null,"Operation","Ready","Standby","Off",null,null,"Process time","General description of an intended process running on the machine",null,null,null,"Operation","Ready","Standby","Off"]
[null,null,null,null,{"$f":"C7","v":"00:04:30"},null,null,null,null,null,null,null,null,null,null,{"$f":"M7","v":"00:06:00"}]
[null,"Average cycle time [hh:mm:ss]",3.1249999999999997E-3,null,null,{"$f":"C8*C9","v":"00:00:10"},null,null,null,null,null,"Average cycle time [hh:mm:ss]","00:06:00",null,"Average cycle time is 6 minutes. This time does include the productive part of the cycle  only (no tool changes)",null,{"$f":"M8","v":"00:00:12"}]
[null,"Average time for one tool change [hh:mm:ss]",2.3148148148148147E-5,null,null,null,null,null,null,null,null,"Average tool change time  [hh:mm:ss]","00:00:12",null,"The tool changes for during one process take 1 minute of time, there are 5 tool changes in total"]
[null,"Number of tool changes per cycle",5,null,null,null,null,null,null,null,null,"Number of tool changes",5]
[null,"Batch size",200,null,null,null,null,null,null,null,null,"Batch size",200,null,"With one setting, a batch of 200 equal products is manufactured"]
{"$rows_left_out":64}
{"sheet":"Infrastructure","index":4,"n_rows":35,"n_cols":22,"rows_kept":35,"cut":false,"hidden":false,"merged":[[17,19,17,21],[20,19,20,21],[26,19,26,21],[32,19,32,21],[36,2,36,4],[20,2,20,4],[26,2,26,4],[32,2,32,4],[1,0,1,4],[9,1,9,4],[4,1,4,4],[6,2,6,4],[17,2,17,4],[11,2,11,4],[12,1,14,1],[12,18,14,18],[11,19,11,21],[1,17,1,21],[4,18,4,21],[6,19,6,21],[9,18,9,21],[2,17,3,21]]}
[null,null,null,null,{"$f":"Version","v":"ET-MTED-V3R1"}]
["Infrastructure",null,null,null,null,null,null,null,null,null,null,null,null,null,null,null,null,"Infrastructure"]
[null,null,null,null,null,null,null,null,null,null,null,null,null,null,null,null,null,"EXAMPLE"]
[]
["Energy supply","Characterizations about the electrical energy source used to supply the machine are required here",null,null,null,null,null,null,null,null,null,null,null,null,null,null,null,"Energy supply","Characterizations about the electrical energy source used to supply the machine are required here"]
[]
[null,"Type of Energy source","EU-Mix",null,null,null,null,null,null,null,null,null,null,null,null,null,null,null,"Type of Energy source","CH-Mix"]
[]
[]
["Infrastructures","Power demand and mode of operation for the infrastructure devices. As guideline, proposals for the power demand are given based on the machine parameters. Some of these proposals may require additional parameters.",null,null,null,null,null,null,null,null,null,null,null,null,null,null,null,"Infrastructures","Power demand and mode of operation for the infrastructure devices. As guideline, proposals for the power demand are given based on the machine parameters."]
{"$rows_left_out":26}
{"sheet":"Results","index":5,"n_rows":103,"n_cols":25,"rows_kept":103,"cut":false,"hidden":false,"merged":[[80,5,90,8],[24,1,24,7],[1,0,1,8],[64,5,77,8],[14,2,14,3],[15,2,15,3],[16,2,16,3],[22,1,22,8],[3,1,3,7],[10,1,10,7],[80,15,90,18],[1,10,1,18],[14,12,14,13],[15,12,15,13],[16,12,16,13],[24,11,24,17],[64,15,77,18],[2,10,2,18],[22,11,22,18],[3,11,3,17],[10,11,10,17]]}
[null,null,null,null,null,null,null,null,{"$f":"Version","v":"ET-MTED-V3R1"}]
["Results",null,null,null,null,null,null,null,null,null,"Results"]
[null,null,null,null,null,null,null,null,null,null,"EXPAMLE"]
["Type","Select the frame of reference for the analysis (over the annual produced fleet, per machine or per part manufactured on a machine)",null,null,null,null,null,null,null,null,"Type","Select the frame of reference for the analysis (over the annual produced fleet, per machine or per part manufactured on a machine)"]
[null,"Results based on:","machine",null,null,null,null,null,null,null,null,"Results based on:","machine"]
[null,"factor",{"$f":"VLOOKUP(C5,$B$7:$C$9,2,FALSE)","v":1},null,null,null,null,null,null,null,null,"factor",{"$f":"VLOOKUP(M5,$B$7:$C$9,2,FALSE)","v":1}]
[null,"fleet",{"$f":"MachineUnitsSold","v":12},null,null,null,null,null,null,null,null,"fleet",{"$f":"MachineUnitsSold","v":12}]
[null,"machine",1,null,null,null,null,null,null,null,null,"machine",1]
[null,"part",{"$f":"1/Calculation!C154","v":8.0940581097305732E-6},null,null,null,null,null,null,null,null,"part",{"$f":"1/Calculation!M154","v":{"$error":"#DIV/0!"}}]
[]
{"$rows_left_out":94}
{"sheet":"Comparision","index":6,"n_rows":15,"n_cols":12,"rows_kept":15,"cut":false,"hidden":false,"merged":[[1,0,1,8]]}
[null,null,null,null,null,null,null,null,{"$f":"Version","v":"ET-MTED-V3R1"}]
["Comparision (Version Manager)"]
[]
["Settings","Frame of reference",{"$f":"Results!C5","v":"machine"}]
[null,"Unit",{"$f":"Results!C12","v":"kg CO2 eq."}]
[null,null,{"$f":"Comparision!$C$4&\" [\"&Comparision!$C$5&\"]\"","v":"machine [kg CO2 eq.]"}]
[]
[]
["Results","File","Version","Raw Material","Purchasing & Production","Transportation & Packaging","Commissioning","Operation","Recycling","BON [kWh]","productivity, time share [%]","productivity, quantity [Pc/a]"]
[]
{"$rows_left_out":6}
{"sheet":"Calculation","index":7,"n_rows":176,"n_cols":13,"rows_kept":176,"cut":false,"hidden":true,"merged":[[0,10,0,11],[155,0,175,0],[107,0,151,0],[111,3,111,6],[0,0,0,7],[2,1,2,6],[5,0,24,0],[26,0,46,0],[71,0,92,0],[94,0,105,0],[48,0,69,0]]}
["Eco Tool-light Machine tool edition",null,null,null,null,null,null,null,null,null,"Output",null,"Comments"]
[]
["Overview","TODO"]
[]
[]
["Raw materials",null,"Impact Material 1","Impact Material 2","Impact Material 3","Impact Material 4","Impact Material 5","Impact","Mass"]
[null,"Machine"]
[null,"Machine structure",{"$f":"IF(LifeCycle!C9=\"\",0,INDEX(KEA.General.RawMaterial,MATCH(LifeCycle!C9,KEA.General.Name,0)))*LifeCycle!C10","v":4820},{"$f":"IF(LifeCycle!D9=\"\",0,INDEX(KEA.General.RawMaterial,MATCH(LifeCycle!D9,KEA.General.Name,0)))*LifeCycle!D10","v":3200},{"$f":"IF(LifeCycle!E9=\"\",0,INDEX(KEA.General.RawMaterial,MATCH(LifeCycle!E9,KEA.General.Name,0)))*LifeCycle!E10","v":1064},{"$f":"IF(LifeCycle!F9=\"\",0,INDEX(KEA.General.RawMaterial,MATCH(LifeCycle!F9,KEA.General.Name,0)))*LifeCycle!F10","v":58.99},{"$f":"IF(LifeCycle!G9=\"\",0,INDEX(KEA.General.RawMaterial,MATCH(LifeCycle!G9,KEA.General.Name,0)))*LifeCycle!G10","v":0},{"$f":"SUM(C8:G8)","v":9142.99},{"$f":"SUM(LifeCycle!C10:G10)","v":4201},null,"Raw material",{"$f":"SUM(H8:H16)","v":17584.911}]
[null,{"$f":"Modules","v":"Hauptspindel"},{"$f":"IF(LifeCycle!C12=\"\",0,INDEX(KEA.General.RawMaterial,MATCH(LifeCycle!C12,KEA.General.Name,0)))*LifeCycle!C13","v":140.1},{"$f":"IF(LifeCycle!D12=\"\",0,INDEX(KEA.General.RawMaterial,MATCH(LifeCycle!D12,KEA.General.Name,0)))*LifeCycle!D13","v":425.6},{"$f":"IF(LifeCycle!E12=\"\",0,INDEX(KEA.General.RawMaterial,MATCH(LifeCycle!E12,KEA.General.Name,0)))*LifeCycle!E13","v":589.9},{"$f":"IF(LifeCycle!F12=\"\",0,INDEX(KEA.General.RawMaterial,MATCH(LifeCycle!F12,KEA.General.Name,0)))*LifeCycle!F13","v":0},{"$f":"IF(LifeCycle!G12=\"\",0,INDEX(KEA.General.RawMaterial,MATCH(LifeCycle!G12,KEA.General.Name,0)))*LifeCycle!G13","v":0},{"$f":"SUM(C9:G9)","v":1155.5999999999999},{"$f":"SUM(LifeCycle!C13:G13)","v":120}]
[null,"Achse X1",{"$f":"IF(LifeCycle!C14=\"\",0,INDEX(KEA.General.RawMaterial,MATCH(LifeCycle!C14,KEA.General.Name,0)))*LifeCycle!C15","v":233.5},{"$f":"IF(LifeCycle!D14=\"\",0,INDEX(KEA.General.RawMaterial,MATCH(LifeCycle!D14,KEA.General.Name,0)))*LifeCycle!D15","v":53.2},{"$f":"IF(LifeCycle!E14=\"\",0,INDEX(KEA.General.RawMaterial,MATCH(LifeCycle!E14,KEA.General.Name,0)))*LifeCycle!E15","v":58.99},{"$f":"IF(LifeCycle!F14=\"\",0,INDEX(KEA.General.RawMaterial,MATCH(LifeCycle!F14,KEA.General.Name,0)))*LifeCycle!F15","v":0},{"$f":"IF(LifeCycle!G14=\"\",0,INDEX(KEA.General.RawMaterial,MATCH(LifeCycle!G14,KEA.General.Name,0)))*LifeCycle!G15","v":0},345.69,{"$f":"SUM(LifeCycle!C15:G15)","v":61}]
{"$rows_left_out":167}
{"sheet":"Data","index":8,"n_rows":55,"n_cols":16,"rows_kept":55,"cut":false,"hidden":true,"merged":[[45,8,49,10]]}
[]
["Unit",{"$f":"Results!$C$12","v":"kg CO2 eq."}]
[]
[null,null,"Raw material","Production","Recycling","Low. Heat. Val.",null,"Raw material","Production","Recycling","Low. Heat. Val.",null,"Raw material","Production","Recycling","Low. Heat. Val."]
[null,null,{"$f":"KEA.Unit&\"/kg\"","v":"kg CO2 eq./kg"},{"$f":"KEA.Unit&\"/kg\"","v":"kg CO2 eq./kg"},{"$f":"KEA.Unit&\"/kg\"","v":"kg CO2 eq./kg"},{"$f":"KEA.Unit&\"/kg\"","v":"kg CO2 eq./kg"},null,"MJ/kg","MJ/kg","MJ/kg","MJ/kg",null,"kg CO2 eq/kg","kg CO2 eq/kg","kg CO2 eq/kg","kg CO2 eq/kg"]
["General","steel, iron",{"$f":"IF(KEA.Unit=\"MJ\",H6,M6)","v":2.41},{"$f":"IF(KEA.Unit=\"MJ\",I6,N6)","v":2.0083333333333337},{"$f":"IF(KEA.Unit=\"MJ\",J6,O6)","v":0},{"$f":"IF(KEA.Unit=\"MJ\",K6,P6)","v":0},null,30,25,-16,0,null,2.41,2.0083333333333337,0,0]
[null,"cast iron",1.6,0.42666666666666669,0,0,null,45,12,-16,0,null,1.6,0.42666666666666669,0,0]
[null,"steel, high-alloyed ",4.67,1.75125,0,0,null,80,30,-16,0,null,4.67,1.75125,0,0]
[null,"PE, PP, PET, Polyester",2.91,0.72750000000000004,0,0,null,80,20,-16,32,null,2.91,0.72750000000000004,0,0]
[null,"PS",3.7,0.82222222222222219,0,0,null,90,20,-16,32,null,3.7,0.82222222222222219,0,0]
{"$rows_left_out":46}
{"sheet":"About","index":9,"n_rows":14,"n_cols":2,"rows_kept":14,"cut":false,"hidden":false,"merged":[[1,0,1,2],[5,1,5,2]]}
[]
["About"]
[]
[]
[]
["Project","This potential estimation tool for machine tools has been developed in the project \"Eco-design Toolbox\" (2011-2013). The goal of the project was, to supply the industry with tools for better product development. "]
[]
["Project lead","Züst Engineering AG\nCH-8607 Seegräben\n\nwww.zuestengineering.ch\nrainer.zuest@zuestengineering.ch"]
[]
["Research Partners","Institute for machine tools and manufacturing (IWF)\nETH Zürich\n\nwww.iwf.mavt.ethz.ch\nwww.inspire.ethz.ch\nweiss@inspire.ethz.ch"]
{"$rows_left_out":5}
{"sheet":"History","index":10,"n_rows":44,"n_cols":8,"rows_kept":44,"cut":false,"hidden":true,"merged":[[3,1,3,3],[0,0,0,5]]}
["History"]
[]
[]
["Current Version:",{"$f":"H44","v":"ET-MTED-V3R1"}]
[]
[]
["Name","V","R","Author","Date","Description","New Version?","Current?"]
[{"$f":"IF(D8=\"\",\"\",\"ET-MTED-V\"&B8&\"R\"&C8)","v":"ET-MTED-V1R0"},1,0,"ZS-inspire","2012-10-16","Initial Creation","x",{"$f":"IF(A8=\"\",H7,A8)","v":"ET-MTED-V1R0"}]
[{"$f":"IF(D9=\"\",\"\",\"ET-MTED-V\"&B9&\"R\"&C9)","v":"ET-MTED-V1R1"},{"$f":"IF(D9=\"\",\"\",IF(G9=\"\",B8,B8+1))","v":1},{"$f":"IF(D9=\"\",\"\",IF(B9-B8=0,C8+1,0))","v":1},"ZS-inspire","2012-11-11","Minor adaptions",null,{"$f":"IF(A9=\"\",H8,A9)","v":"ET-MTED-V1R1"}]
["ET-MTED-V2R0",{"$f":"IF(D10=\"\",\"\",IF(G10=\"\",B9,B9+1))","v":2},{"$f":"IF(D10=\"\",\"\",IF(B10-B9=0,C9+1,0))","v":0},"ZS-inspire","2013-01-23","New Model","x","ET-MTED-V2R0"]
{"$rows_left_out":34}